{"text_format":"1","workbook":"xlsx","n_sheets":11,"sheets":["Calculator","Wholesale Details","Calculations","Freight","Duty","Excise","National Markup","Small Producer Markup","COS","Enviro & Container","List"],"not_rendered":{"charts":0,"images":1,"macros":1,"external_links":0,"defined_names":1,"comments":1,"pivot_tables":0},"unopened":[],"bounds":{"document_bytes":16777216,"sheet_cells":100000,"rows_first":2000,"rows_last":500,"rows_between":2000,"halvings":0,"cell_chars":16384,"cell_head_chars":4096},"cells_cut":0,"cells_raw":0,"read":"whole","date_system":"1900"}

{"sheet":"Calculator","index":0,"n_rows":59,"n_cols":14,"rows_kept":59,"cut":false,"hidden":false,"merged":[[31,11,31,14],[5,6,5,9],[5,11,5,14],[1,1,1,14],[5,1,5,4],[3,1,3,14]]}
[]
[null,"SLGA Pricing Calculator Worksheet   Effective October 1, 2026"]
[]
[null,"Instructions: Please complete the product information section to produce the wholesale base price and review product details to ensure correctness of wholesale base price.  If necessary use the \"Target Wholesale Price\" section to work backwards from WBP to vendor quote. [All fields under the product information section must be complete for this to work]"]
[]
[null,"PRODUCT INFORMATION",null,null,null,null,"PRODUCT REVIEW",null,null,null,null,"WHOLESALE PRICE - SELLING UNIT"]
[]
[null,null,"1. Product Category",null,null,null,null,"Category:",{"$f":"'Wholesale Details'!D3","v":0},null,null,null,"Quote:",{"$f":"'Wholesale Details'!I4","v":{"$error":"#DIV/0!"}}]
[]
[null,null,"2. Product Sub-Category",null,null,null,null,"Sub-Category:",{"$f":"IF('Wholesale Details'!D4=0,\"None\",'Wholesale Details'!D4)","v":"None"},null,null,null,"Freight:",{"$f":"'Wholesale Details'!I5","v":0}]
{"$rows_left_out":50}
{"sheet":"Wholesale Details","index":1,"n_rows":33,"n_cols":9,"rows_kept":33,"cut":false,"hidden":true,"merged":[[18,6,18,9],[2,6,2,9],[1,1,1,4],[1,6,1,9]]}
[]
[null,"INPUT INFORMATION",null,null,null,null,"OUTPUT INFORMATION"]
[null,null,"Category:",{"$f":"Calculator!D8","v":0},null,null,"SELLING UNIT"]
[null,null,"Sub-Category:",{"$f":"Calculator!D10","v":0},null,null,null,"Content Quote:",{"$f":"D15","v":{"$error":"#DIV/0!"}}]
[null,null,"Base:",{"$f":"Calculator!D12","v":0},null,null,null,"Freight:",{"$f":"Calculations!D10","v":0}]
[null,null,"ABV:",{"$f":"Calculator!D14","v":0},null,null,null,"Duty:",{"$f":"Calculations!I20","v":0}]
[null,null,"Container Type:",{"$f":"Calculator!D16","v":0},null,null,null,"Excise:",{"$f":"Calculations!N18","v":{"$error":"#N/A"}}]
[null,null,"Selling Units per Case:",{"$f":"Calculator!D18","v":0},null,null,null,"Tariff",{"$f":"IF(Calculator!D30=\"yes\",Calculator!N8*50%,\"\")","v":""}]
[null,null,"Containers per Selling Unit:",{"$f":"Calculator!D22","v":0},null,null,null,"Landed Cost:",{"$f":"SUM(I4:I8)","v":{"$error":"#DIV/0!"}}]
[null,null,"Container Volume:",{"$f":"D12/D9","v":{"$error":"#DIV/0!"}},null,null,null,"Mark-up:",{"$f":"Calculations!S18","v":0}]
{"$rows_left_out":24}
{"sheet":"Calculations","index":2,"n_rows":29,"n_cols":24,"rows_kept":29,"cut":false,"hidden":true,"merged":[[20,16,20,19],[16,21,16,24],[1,11,1,14],[1,1,1,4],[1,6,1,9],[1,16,1,19],[1,21,1,24],[12,1,12,4]]}
[]
[null,"FREIGHT",null,null,null,null,"DUTY",null,null,null,null,"Excise",null,null,null,null,"Mark-up",null,null,null,null,"Cost of Service"]
[null,null,"Region:",{"$f":"'Wholesale Details'!D23","v":0},null,null,null,"Category:",{"$f":"'Wholesale Details'!D3","v":0},null,null,null,"Category:",{"$f":"'Wholesale Details'!D3","v":0},null,null,null,"Category:",{"$f":"'Wholesale Details'!D3","v":0},null,null,null,"Category:"]
[null,null,"Distributor:",{"$f":"'Wholesale Details'!D26","v":0},null,null,null,"Sub-Category:",{"$f":"'Wholesale Details'!D4","v":0},null,null,null,"Sub-Category:",{"$f":"'Wholesale Details'!D4","v":0},null,null,null,"ABV:",{"$f":"'Wholesale Details'!D6","v":0},null,null,null,"Distributor:",{"$f":"'Wholesale Details'!D26","v":0}]
[null,null,"Freight Applied?",{"$f":"IF(D4=\"SLGA\",\"Yes\",\"No\")","v":"No"},null,null,null,"Base:",{"$f":"'Wholesale Details'!D5","v":0},null,null,null,"Base:",{"$f":"'Wholesale Details'!D5","v":0},null,null,null,"Previous Calendar Year Production:",{"$f":"'Wholesale Details'!D27","v":">200,000 L - National Producer"},null,null,null,"Origin:"]
[null,null,"Volume:",null,null,null,null,"ABV:",{"$f":"'Wholesale Details'!D6","v":0},null,null,null,"ABV:",{"$f":"'Wholesale Details'!D6","v":0},null,null,null,"National Producer?",{"$f":"IF(S5=List!Y8,\"Yes\",IF(S5=List!Y23,\"Yes\",\"No\"))","v":"Yes"},null,null,null,"Sourced From:",{"$f":"'Wholesale Details'!D22","v":0}]
[null,null,"Selling Unit:",{"$f":"'Wholesale Details'!D12","v":0},null,null,null,"Origin:",{"$f":"'Wholesale Details'!D21","v":0},null,null,null,"Duty Status:",{"$f":"'Wholesale Details'!D24","v":0},null,null,null,"Small Producer Markup",{"$f":"'Small Producer Markup'!L3","v":0},null,null,null,"Selling Units Per Case:",{"$f":"'Wholesale Details'!D8","v":0}]
[null,null,"Rate per Litre:",{"$f":"IF(D5=\"yes\",Freight!G4,0)","v":0},null,null,null,"Sourced From:",{"$f":"'Wholesale Details'!D22","v":0},null,null,null,"Distributor:",{"$f":"'Wholesale Details'!D26","v":0},null,null,null,"Small Producer UoM",{"$f":"'Small Producer Markup'!M3","v":{"$error":"#N/A"}},null,null,null,"COS applied?"]
[null,null,"Freight:",null,null,null,null,"Duty Status:",{"$f":"'Wholesale Details'!D24","v":0},null,null,null,"Volume:",null,null,null,null,"Landed Cost:"]
[null,null,"Selling Unit:",{"$f":"D8*D7","v":0},null,null,null,"Trade Agreement:",{"$f":"'Wholesale Details'!D25","v":0},null,null,null,"Selling Unit:",{"$f":"'Wholesale Details'!D12","v":0},null,null,null,"Selling Unit:",{"$f":"'Wholesale Details'!I9","v":{"$error":"#DIV/0!"}}]
{"$rows_left_out":20}
{"sheet":"Freight","index":3,"n_rows":42,"n_cols":7,"rows_kept":42,"cut":false,"hidden":true,"merged":[]}
[]
[null,null,null,"Freight"]
[null,"Region","Region Rule","Rate per Litre",null,"Region","Freight Rate per Litre"]
[null,"Alberta - Calgary",{"$f":"IF(B4=$F$4,1,0)","v":0},0.13,null,{"$f":"Calculations!D3","v":0},{"$f":"SUMIFS(D4:D42,C4:C42,1)","v":0}]
[null,"Alberta - Lethbridge",{"$f":"IF(B5=$F$4,1,0)","v":0},0.37]
[null,"Alberta - St. Albert",0,0.18]
[null,"British Columbia - Kelowna",0,0.31]
[null,"British Columbia - Oliver",0,0.28999999999999998]
[null,"British Columbia - Vancouver & Area ",0,0.25]
[null,"Manitoba - Winnipeg",0,0.5]
{"$rows_left_out":33}
{"sheet":"Duty","index":4,"n_rows":60,"n_cols":23,"rows_kept":60,"cut":false,"hidden":true,"merged":[]}
[]
[null,"Category","Category Rule","Sub-Category","Sub-Category Rule","Base","Base Rule","Volume Low","Volume High","Volume Rule","ABV Low","ABV High","ABV Rule","Duty Rate","UoM",null,"Category","Sub-Category","Base","Volume","ABV","Duty Rate","UoM"]
[null,"Beer",{"$f":"IF($Q$3=B3,1,0)","v":0},0,{"$f":"IF($R$3=D3,1,0)","v":1},0,{"$f":"IF($S$3=F3,1,0)","v":1},0,9.9999999999999997E+98,{"$f":"IF(AND($T$3>H3,$T$3<=I3),1,0)","v":0},0,1,{"$f":"IF(AND($U$3>K3,$U$3<=L3),1,0)","v":0},0,0,null,{"$f":"Calculations!I3","v":0},{"$f":"Calculations!I4","v":0},{"$f":"Calculations!I5","v":0},{"$f":"Calculations!I12","v":0},{"$f":"Calculations!I6","v":0},{"$f":"SUMIFS(N3:N60,C3:C60,1,E3:E60,1,G3:G60,1,J3:J60,1,M3:M60,1)","v":0},{"$f":"VLOOKUP(V3,N3:O59,2,FALSE)","v":0}]
[null,"Wine",0,"Table Wine",{"$f":"IF($R$3=D4,1,0)","v":0},0,{"$f":"IF($S$3=F4,1,0)","v":1},0,2,{"$f":"IF(AND($T$3>H4,$T$3<=I4),1,0)","v":0},0,0.13700000000000001,{"$f":"IF(AND($U$3>K4,$U$3<=L4),1,0)","v":0},1.8700000000000001E-2,"LTR"]
[null,"Wine",0,"Table Wine",0,0,1,0,2,0,0.13700000000000001,0.14899999999999999,{"$f":"IF(AND($U$3>K5,$U$3<=L5),1,0)","v":0},4.6800000000000001E-2,"LTR"]
[null,"Wine",0,"Table Wine",0,0,1,0,2,0,0.14899999999999999,0.22900000000000001,{"$f":"IF(AND($U$3>K6,$U$3<=L6),1,0)","v":0},0,0]
[null,"Wine",0,"Table Wine",0,0,1,0,2,0,0.22900000000000001,1,0,0,0]
[null,"Wine",0,"Table Wine",0,0,1,2,9.9999999999999997E+98,0,0,0.22900000000000001,{"$f":"IF(AND($U$3>K8,$U$3<=L8),1,0)","v":0},0,0]
[null,"Wine",0,"Table Wine",0,0,1,2,9.9999999999999997E+98,0,0.22900000000000001,1,{"$f":"IF(AND($U$3>K9,$U$3<=L9),1,0)","v":0},0,0]
[null,"Wine",0,"Sparkling Wine",0,0,1,0,9.9999999999999997E+98,0,0,0.22900000000000001,{"$f":"IF(AND($U$3>K10,$U$3<=L10),1,0)","v":0},0,0]
{"$rows_left_out":51}
{"sheet":"Excise","index":5,"n_rows":31,"n_cols":23,"rows_kept":31,"cut":false,"hidden":true,"merged":[]}
[]
[null,"Category","Category Rule","Sub-Category","Sub-Category Rule","Base","Base Rule","Volume Low","Volume High","Volume Rule","ABV Low","ABV High","ABV Rule","Excise Rate","UoM",null,"Category","Sub-Category","Base","Volume","ABV","Excise Rate","UoM"]
[null,"Beer",{"$f":"IF($Q$3=B3,1,0)","v":0},0,{"$f":"IF(B3=\"Refreshment\",IF($R$3=D3,1,0),1)","v":1},0,{"$f":"IF($S$3=F3,1,0)","v":1},0,9.9999999999999997E+98,{"$f":"IF(AND($T$3>H3,$T$3<=I3),1,0)","v":0},0,1.2E-2,{"$f":"IF(AND($U$3>K3,$U$3<=L3),1,0)","v":0},3.1280000000000002E-2,"LTR",{"$f":"+N3*$P$31","v":0},{"$f":"Calculations!I3","v":0},{"$f":"Calculations!I4","v":0},{"$f":"Calculations!I5","v":0},{"$f":"Calculations!I12","v":0},{"$f":"Calculations!N6","v":0},{"$f":"SUMIFS(N3:N30,C3:C30,1,E3:E30,1,G3:G30,1,J3:J30,1,M3:M30,1)","v":0},{"$f":"VLOOKUP(V3,N3:O30,2,FALSE)","v":{"$error":"#N/A"}}]
[null,"Beer",0,0,{"$f":"IF(B4=\"Refreshment\",IF($R$3=D4,1,0),1)","v":1},0,{"$f":"IF($S$3=F4,1,0)","v":1},0,9.9999999999999997E+98,0,1.2E-2,2.5000000000000001E-2,0,0.1885,"LTR",{"$f":"+N4*$P$31","v":0}]
[null,"Beer",0,0,1,0,1,0,9.9999999999999997E+98,0,2.5000000000000001E-2,0.11899999999999999,0,0.37690000000000001,"LTR",0]
[null,"Beer",0,0,1,0,1,0,9.9999999999999997E+98,0,0.11899999999999999,1,0,14.117000000000001,"LPA",0]
[null,"Wine",0,0,1,0,1,0,2,0,0,7.0000000000000007E-2,0,0.35799999999999998,"LTR",0]
[null,"Wine",0,0,1,0,1,0,2,0,7.0000000000000007E-2,0.22900000000000001,0,0.745,"LTR",0]
[null,"Wine",0,0,1,0,1,0,2,0,0.22900000000000001,1,0,14.117000000000001,"LPA",0]
[null,"Wine",0,0,1,0,1,2,9.9999999999999997E+98,0,0,0.14899999999999999,0,0.745,"LTR",0]
{"$rows_left_out":22}
{"sheet":"National Markup","index":6,"n_rows":34,"n_cols":17,"rows_kept":34,"cut":false,"hidden":true,"merged":[[1,15,1,16]]}
[]
[null,null,null,null,null,null,null,null,null,null,null,null,null,null,null,"Markup"]
[null,"Product Category","Catgeory Rule","ABV low","ABV high","ABV Rule","Mark-up","Landed Cost","Volume","Landed Cost/L","Low","High","Markup per Litre","Markup per Selling Unit",null,"Per Litre","Markup per Selling Unit"]
[null,"Wine",{"$f":"IF(Calculations!$S$3='National Markup'!B4,1,0)","v":0},0,5.0000000000000001E-3,{"$f":"IF(AND(Calculations!$S$4>=D4,Calculations!$S$4<=E4),\"1\",\"0\")","v":"1"},0.3,{"$f":"Calculations!$S$14","v":{"$error":"#DIV/0!"}},{"$f":"Calculations!$S$16","v":0},null,0,9.9999999999999997E+98,null,{"$f":"IF(AND(H4>$K4,H4<=$L4),H4*$G4,0)","v":{"$error":"#DIV/0!"}},null,{"$f":"SUMIFS(M4:M34,C4:C34,1,F4:F34,1)","v":0},{"$f":"SUMIFS(N4:N34,C4:C34,1,F4:F34,1)","v":0}]
[null,"Wine",{"$f":"IF(Calculations!$S$3='National Markup'!B5,1,0)","v":0},6.0000000000000001E-3,7.0000000000000007E-2,{"$f":"IF(AND(Calculations!$S$4>D5,Calculations!$S$4<=E5),\"1\",\"0\")","v":"0"},0.88,{"$f":"Calculations!$S$14","v":{"$error":"#DIV/0!"}},{"$f":"Calculations!$S$16","v":0},{"$f":"H5/I5","v":{"$error":"#DIV/0!"}},0,9.9999999999999997E+98,{"$f":"IF(AND(J5>$K5,J5<=$L5),J5*$G5,$L5*$G5)","v":{"$error":"#DIV/0!"}},{"$f":"M5*I5","v":{"$error":"#DIV/0!"}}]
[null,"Wine",{"$f":"IF(Calculations!$S$3='National Markup'!B6,1,0)","v":0},7.0000000000000007E-2,0.16,{"$f":"IF(AND(Calculations!$S$4>D6,Calculations!$S$4<=E6),\"1\",\"0\")","v":"0"},0.99,{"$f":"Calculations!$S$14","v":{"$error":"#DIV/0!"}},{"$f":"Calculations!$S$16","v":0},{"$error":"#DIV/0!"},0,12.5,{"$f":"IF(AND(J6>$K6,J6<=$L6),J6*$G6,$L6*$G6)","v":{"$error":"#DIV/0!"}},{"$f":"M6*I6","v":{"$error":"#DIV/0!"}}]
[null,"Wine",{"$f":"IF(Calculations!$S$3='National Markup'!B7,1,0)","v":0},7.0000000000000007E-2,0.16,{"$f":"IF(AND(Calculations!$S$4>D7,Calculations!$S$4<=E7),\"1\",\"0\")","v":"0"},0.3,{"$f":"Calculations!$S$14","v":{"$error":"#DIV/0!"}},{"$f":"Calculations!$S$16","v":0},{"$error":"#DIV/0!"},12.5,9.9999999999999997E+98,{"$f":"IF(AND(J7>$K7,J7<=$L7),(J7-$K7)*$G7,0)","v":{"$error":"#DIV/0!"}},{"$error":"#DIV/0!"}]
[null,"Wine",{"$f":"IF(Calculations!$S$3='National Markup'!B8,1,0)","v":0},0.16,1,{"$f":"IF(AND(Calculations!$S$4>D8,Calculations!$S$4<=E8),\"1\",\"0\")","v":"0"},1.3,{"$f":"Calculations!$S$14","v":{"$error":"#DIV/0!"}},{"$f":"Calculations!$S$16","v":0},{"$error":"#DIV/0!"},0,25,{"$f":"IF(AND(J8>$K8,J8<=$L8),J8*$G8,$L8*$G8)","v":{"$error":"#DIV/0!"}},{"$error":"#DIV/0!"}]
[null,"Wine",{"$f":"IF(Calculations!$S$3='National Markup'!B9,1,0)","v":0},0.16,1,{"$f":"IF(AND(Calculations!$S$4>D9,Calculations!$S$4<=E9),\"1\",\"0\")","v":"0"},0.6,{"$f":"Calculations!$S$14","v":{"$error":"#DIV/0!"}},{"$f":"Calculations!$S$16","v":0},{"$error":"#DIV/0!"},25.01,37.5,{"$f":"IF(AND(J9>$K9,J9<=$L9),(J9-$K9)*$G9,IF(J9>$L9,($L9-K9)*$G9,))","v":{"$error":"#DIV/0!"}},{"$error":"#DIV/0!"}]
[null,"Wine",{"$f":"IF(Calculations!$S$3='National Markup'!B10,1,0)","v":0},0.16,1,{"$f":"IF(AND(Calculations!$S$4>D10,Calculations!$S$4<=E10),\"1\",\"0\")","v":"0"},0.3,{"$f":"Calculations!$S$14","v":{"$error":"#DIV/0!"}},{"$f":"Calculations!$S$16","v":0},{"$error":"#DIV/0!"},37.5,9.9999999999999997E+98,{"$f":"IF(AND(J10>$K10,J10<$L10),(J10-$K10)*$G10,0)","v":{"$error":"#DIV/0!"}},{"$f":"M10*I10","v":{"$error":"#DIV/0!"}}]
{"$rows_left_out":25}
{"sheet":"Small Producer Markup","index":7,"n_rows":38,"n_cols":13,"rows_kept":38,"cut":false,"hidden":true,"merged":[]}
[]
[null,"Product Category","Product Category Rule","Global Production","Global Production Rule","Markup Amount","UoM",null,"ABV","Category:","Previous Calendar Year Production:","Small Producer Markup","Small Producer Markup UoM"]
[null,"Wine",{"$f":"IF($J$3=B3,1,0)","v":0},"<25,000 L",{"$f":"IF($K$3=D3,1,0)","v":0},0.45,"%",null,{"$f":"Calculations!S4","v":0},{"$f":"Calculations!S3","v":0},{"$f":"Calculations!S5","v":">200,000 L - National Producer"},{"$f":"SUMIFS(F3:F38,C3:C38,1,E3:E38,1)","v":0},{"$f":"VLOOKUP(L3,F3:G38,2,FALSE)","v":{"$error":"#N/A"}}]
[null,"Wine",0,"25,0001 to 50,000 L",{"$f":"IF($K$3=D4,1,0)","v":0},0.5,"%"]
[null,"Wine",0,"50,001 to 75,000 L",0,0.56000000000000005,"%"]
[null,"Wine",0,"75,001 to 100,000 L",0,0.64,"%"]
[null,"Wine",0,"100,001 to 150,000 L",0,0.74,"%"]
[null,"Wine",0,"150,001 to 200,000 L",0,0.85,"%"]
[null,"Spirit",0,"<25,000 L",0,0.73,"%"]
[null,"Spirit",0,"25,0001 to 50,000 L",0,0.8,"%"]
{"$rows_left_out":29}
{"sheet":"COS","index":8,"n_rows":19,"n_cols":8,"rows_kept":19,"cut":false,"hidden":true,"merged":[]}
[]
[null,"Sourced From","Source Rule","Category","Category Rule","Rate $/Litre",null,"Rate"]
[null,"Canada",{"$f":"IF(B3=Calculations!$X$6,1,0)","v":0},"Wine",{"$f":"IF('Wholesale Details'!$D$3=\"Wine\",1,0)","v":0},0.36,null,{"$f":"IF(C19=\"SLGA\",SUMIFS(F3:F17,$E3:$E17,1,$C3:$C17,1),0)","v":0}]
[null,"Canada",{"$f":"IF(B4=Calculations!$X$6,1,0)","v":0},"Spirit",{"$f":"IF('Wholesale Details'!$D$3=\"Spirit\",1,0)","v":0},0.36]
[null,"Canada",{"$f":"IF(B5=Calculations!$X$6,1,0)","v":0},"Liqueur",{"$f":"IF('Wholesale Details'!$D$3=\"Liqueur\",1,0)","v":0},0.36]
[null,"Canada",{"$f":"IF(B6=Calculations!$X$6,1,0)","v":0},"Refreshment",{"$f":"IF('Wholesale Details'!$D$3=\"Refreshment\",1,0)","v":0},0.24]
[null,"Canada",{"$f":"IF(B7=Calculations!$X$6,1,0)","v":0},"Beer",{"$f":"IF('Wholesale Details'!$D$3=\"Beer\",1,0)","v":0},0.24]
[null,"USA",{"$f":"IF(B8=Calculations!$X$6,1,0)","v":0},"Wine",{"$f":"IF('Wholesale Details'!$D$3=\"Wine\",1,0)","v":0},0.55000000000000004]
[null,"USA",{"$f":"IF(B9=Calculations!$X$6,1,0)","v":0},"Spirit",{"$f":"IF('Wholesale Details'!$D$3=\"Spirit\",1,0)","v":0},0.55000000000000004]
[null,"USA",{"$f":"IF(B10=Calculations!$X$6,1,0)","v":0},"Liqueur",{"$f":"IF('Wholesale Details'!$D$3=\"Liqueur\",1,0)","v":0},0.55000000000000004]
{"$rows_left_out":10}
{"sheet":"Enviro & Container","index":9,"n_rows":21,"n_cols":13,"rows_kept":21,"cut":false,"hidden":true,"merged":[]}
[]
[null,"Container Type","Container Rule","Volume Low","Volume High","Volume Rule","Environmental Charge","Container Deposit",null,"Container Type","Container Volume","Environmental Charge","Container Deposit"]
[null,"Aluminum Can",{"$f":"IF($J$3=B3,1,0)","v":0},0,1,{"$f":"IF(AND($K$3>D3,$K$3<E3),1,0)","v":{"$error":"#DIV/0!"}},7.0000000000000007E-2,0.1,null,{"$f":"Calculations!D14","v":0},{"$f":"Calculations!D17","v":{"$error":"#DIV/0!"}},{"$f":"SUMIFS(G3:G21,C3:C21,1,F3:F21,1)","v":0},{"$f":"SUMIFS(H3:H21,C3:C21,1,F3:F21,1)","v":0}]
[null,"Aluminum Can",0,1,9.9999999999999997E+98,{"$f":"IF(AND($K$3>=D4,$K$3<E4),1,0)","v":{"$error":"#DIV/0!"}},7.0000000000000007E-2,0.25]
[null,"Aluminum Pouch",0,0,9.9999999999999997E+98,{"$f":"IF(AND($K$3>D5,$K$3<E5),1,0)","v":{"$error":"#DIV/0!"}},0.08,0]
[null,"Aseptic Carton",0,0,1,{"$f":"IF(AND($K$3>D6,$K$3<E6),1,0)","v":{"$error":"#DIV/0!"}},0.05,0.1]
[null,"Aseptic Carton",0,1,9.9999999999999997E+98,{"$f":"IF(AND($K$3>=D7,$K$3<E7),1,0)","v":{"$error":"#DIV/0!"}},0.05,0.25]
[null,"Bag-in-Box",0,1,9.9999999999999997E+98,{"$f":"IF(AND($K$3>=D8,$K$3<E8),1,0)","v":{"$error":"#DIV/0!"}},0,0]
[null,"Keg",0,0,9.9999999999999997E+98,{"$f":"IF(AND($K$3>D9,$K$3<E9),1,0)","v":{"$error":"#DIV/0!"}},0,20]
[null,"Keg (No Deposit)",0,0,9.9999999999999997E+98,{"$f":"IF(AND($K$3>D10,$K$3<E10),1,0)","v":{"$error":"#DIV/0!"}},0,0]
{"$rows_left_out":12}
{"sheet":"List","index":10,"n_rows":43,"n_cols":25,"rows_kept":43,"cut":false,"hidden":true,"merged":[]}
["Product Category",null,"Product Sub-Category - Wine",null,"Product Base - Cooler",null,"Vendor Quote",null,"Container Type",null,"Seasonal Gift Pack?",null,"Origin",null,"Sourced From - Domestic",null,"Region - Canada",null,"Duty Status",null,"Trade Agreement",null,"Distributor",null,"Production - Refreshment/Spirit/Liqueur/Wine"]
["Wine",null,"Table Wine",null,"Spirit/Liqueur",null,"per Case",null,"Aluminum Can",null,"Yes",null,"Domestic",null,"Canada",null,"Alberta - Calgary",null,"Duty Deferred",null,"Yes",null,"SLGA",null,"<25,000 L"]
["Spirit",null,"Sparkling Wine",null,"Wine",null,"per Selling Unit",null,"Aluminum Pouch",null,"No",null,"Import",null,"USA",null,"Alberta - Lethbridge",null,"Duty Paid",null,"No",null,"Privately Distributed",null,"25,0001 to 50,000 L"]
["Liqueur",null,"Dessert/Fortified Wine",null,"Malt",null,null,null,"Aseptic Carton",null,null,null,null,null,"Other",null,"Alberta - St. Albert",null,null,null,null,null,null,null,"50,001 to 75,000 L"]
["Refreshment",null,"Fruit Wine/Sake",null,null,null,"Unit Size",null,"Bag-in-Box",null,null,null,null,null,null,null,"British Columbia - Kelowna",null,null,null,null,null,null,null,"75,001 to 100,000 L"]
["Beer",null,"Flavoured & Other",null,null,null,"per Selling Unit",null,"Keg",null,null,null,"Tariff",null,null,null,"British Columbia - Oliver",null,null,null,null,null,null,null,"100,001 to 150,000 L"]
[null,null,"Non-Alcoholic",null,null,null,null,null,"Keg (No Deposit)",null,null,null,"Yes",null,null,null,"British Columbia - Vancouver & Area ",null,null,null,null,null,null,null,"150,001 to 200,000 L"]
[null,null,null,null,null,null,null,null,"Non-Refillable Glass",null,null,null,null,null,null,null,"Manitoba - Winnipeg",null,null,null,null,null,null,null,">200,000 L - National Producer"]
[null,null,"Product Sub-Category - Spirit",null,null,null,null,null,"PET",null,null,null,null,null,null,null,"Ontario - Brampton"]
[null,null,"Whiskey",null,null,null,null,null,"Refillable Glass",null,null,null,null,null,null,null,"Ontario - Toronto & Area",null,null,null,null,null,null,null,"Production - Beer"]
{"$rows_left_out":33}